{"text_format":"1","workbook":"xlsx","n_sheets":16,"sheets":["Change Country version","English","Chinese","Japanese","Ukrainian","Russian","South African","French","Brazilian","USCanadian","Indian","South Korean","Sheet2","Sheet3","jazykove verze","English (2)"],"not_rendered":{"charts":0,"images":12,"macros":1,"external_links":0,"defined_names":38,"comments":0,"pivot_tables":0},"unopened":[],"bounds":{"document_bytes":16777216,"sheet_cells":100000,"rows_first":2000,"rows_last":500,"rows_between":2000,"halvings":0,"cell_chars":16384,"cell_head_chars":4096},"cells_cut":0,"cells_raw":0,"read":"whole","date_system":"1900"}

{"sheet":"Change Country version","index":0,"n_rows":3,"n_cols":2,"rows_kept":3,"cut":false,"hidden":false,"merged":[]}
[]
[null,"Please select relevant Country version"]
[null,"If your country not is on the list please select English version"]

{"sheet":"English","index":1,"n_rows":29,"n_cols":8,"rows_kept":29,"cut":false,"hidden":false,"merged":[[19,1,19,2],[25,1,25,2],[15,1,15,2],[20,1,20,2],[21,1,21,2],[24,1,24,2],[18,1,18,3],[16,1,16,2],[17,1,17,2],[3,1,3,2],[10,1,10,2],[5,1,5,3],[8,1,8,3],[9,1,9,2],[4,1,4,2],[7,1,7,2],[11,1,11,2],[13,1,13,2],[14,1,14,2],[9,5,9,6],[10,5,10,6],[11,5,11,6],[13,5,13,6],[14,5,14,6],[15,5,15,6],[16,5,16,6],[17,5,17,6],[20,5,20,6],[21,5,21,6],[27,5,27,6],[28,1,28,2],[28,5,28,6],[22,1,22,2],[22,5,22,6],[24,5,24,6],[25,5,25,6],[26,5,26,6],[26,1,26,2],[27,1,27,2]]}
[null,null,"Documentation of company information"]
[]
[null,"Company details"]
[null,"Name of company "]
[null,"VAT number  or  TAX number \n(CVR number, steuer number or company registration number etc.)"]
[]
[null,"Contact details"]
[null,"E-mail address for remittance advice"]
[]
[null,"Bank details",null,"Account 1",null,"Bank details",null,"Account 2 (where applicable)"]
[null,"Bank name",null,null,null,"Bank name"]
[null,"Bank country",null,"please select",null,"Bank country",null,"please select"]
[null,"Bank and Branch code (bank key)","bank key",null,null,"Bank and Branch code (bank key)","bank key"]
[null,"Bank account",null,null,null,"Bank account"]
[null,"Bank account currency",null,null,null,"Bank account currency"]
[null,"Account holder name",null,null,null,"Account holder name"]
[null,"IBAN (If relevant)",null,null,null,"IBAN (If relevant)"]
[null,"SWIFT code",null,null,null,"SWIFT code"]
[]
[null,"Bank details"]
{"$rows_left_out":10}
{"sheet":"Chinese","index":2,"n_rows":34,"n_cols":8,"rows_kept":34,"cut":false,"hidden":false,"merged":[[28,1,28,2],[29,1,29,2],[30,1,30,2],[31,1,31,2],[32,1,32,2],[26,1,26,2],[33,1,33,2],[3,1,3,2],[4,1,4,2],[5,1,5,2],[6,1,6,3],[8,1,8,2],[9,1,9,3],[10,1,10,3],[11,1,11,2],[13,1,13,2],[14,1,14,2],[16,1,16,2],[17,1,17,2],[18,1,18,2],[20,1,20,2],[12,1,12,2],[19,1,19,2],[23,1,23,2],[24,1,24,2],[25,1,25,2],[21,1,21,2],[22,1,22,3],[11,5,11,6],[12,5,12,6],[13,5,13,6],[14,5,14,6],[16,5,16,6],[17,5,17,6],[18,5,18,6],[19,5,19,6],[20,5,20,6],[21,5,21,6],[23,5,23,6],[24,5,24,6],[25,5,25,6],[26,5,26,6],[28,5,28,6],[29,5,29,6],[30,5,30,6],[31,5,31,6],[32,5,32,6],[33,5,33,6]]}
[null,null,"Documentation of company information"]
[]
[null,"Company details"]
[null,"Name of company – English  公司名称 (英文)"]
[null,"Name of company – Chinese 公司名称 (华文)"]
[null,"TAX number 税号 "]
[]
[null,"Contact details"]
[null,"E-mail address (remittance/payment advice) 会计/汇款(邮箱)"]
[]
[]
[null,"Bank details",null,"Account 1",null,"Bank details",null,"Account 2 (where applicable)"]
[null,"Bank Name – English 银行名称 (英文) ",null,null,null,"Bank Name – English 银行名称 (英文) "]
[null,"Bank name – Chinese 银行名称 (华文)",null,null,null,"Bank name – Chinese 银行名称 (华文)"]
[null,"Bank country",null,"please select",null,"Bank country",null,"please select"]
[null,"Bank and Branch code (bank key)",{"$f":"IFERROR(VLOOKUP(D15,Sheet3!A:B,2,\"\"),\"\")","v":""},null,null,"Bank and Branch code (bank key)",{"$f":"IFERROR(VLOOKUP(H15,Sheet3!E:F,2,\"\"),\"\")","v":""}]
[null,"Bank account 银行帐号 ",null,null,null,"Bank account 银行帐号 "]
[null,"Bank account currency",null,null,null,"Bank account currency"]
[null,"Account holder name",null,null,null,"Account holder name"]
[null,"Accountholder name in local characters \n\n开户人的中文姓",null,null,null,"Accountholder name in local characters \n\n开户人的中文姓"]
{"$rows_left_out":15}
{"sheet":"Japanese","index":3,"n_rows":35,"n_cols":8,"rows_kept":35,"cut":false,"hidden":false,"merged":[[35,1,35,3],[28,1,28,2],[30,1,30,2],[31,1,31,2],[32,1,32,2],[33,1,33,2],[34,1,34,2],[9,1,9,3],[10,1,10,3],[11,1,11,2],[17,1,17,2],[19,1,19,2],[3,1,3,2],[4,1,4,2],[5,1,5,2],[6,1,6,3],[8,1,8,2],[11,5,11,6],[12,1,12,2],[12,5,12,6],[13,5,13,6],[13,1,13,2],[15,5,15,6],[16,1,16,2],[16,5,16,6],[17,5,17,6],[15,1,15,2],[31,5,31,6],[23,5,23,6],[24,5,24,6],[27,5,27,6],[26,5,26,6],[18,5,18,6],[28,5,28,6],[29,1,29,2],[29,5,29,6],[30,5,30,6],[19,5,19,6],[20,1,20,2],[20,5,20,6],[21,1,21,3],[22,5,22,6],[27,1,27,2],[22,1,22,2],[26,1,26,2],[18,1,18,2],[23,1,23,2],[24,1,24,2]]}
[null,null,"Documentation of company information"]
[]
[null,"Company details"]
[null,"Name of company (English)会社名（英語）"]
[null,"Name of company (Japanese)会社名 （日本語）"]
[null,"Tax Registration number 税務登録番号"]
[]
[null,"Contact details"]
[null,"E-mail address (remittance advice)   Eメールアドレス(送金通知書)"]
[]
[]
[null,"Bank details",null,"Account 1",null,"Bank details",null,"Account 2 (where applicable)"]
[null,"Bank name 銀行名 ",null,null,null,"Bank name 銀行名 "]
[null,"Bank country",null,"please select",null,"Bank country",null,"please select"]
[null,"Bank key 銀行コード 支店コード",{"$f":"IFERROR(VLOOKUP(D14,Sheet3!A:B,2,\"\"),\"\")","v":""},null,null,"Bank key 銀行コード 支店コード",{"$f":"IFERROR(VLOOKUP(H14,Sheet3!E:F,2,\"\"),\"\")","v":""}]
[null,"Bank account 銀行預金口座 ",null,null,null,"Bank account 銀行預金口座 "]
[null,"Bank account currency",null,null,null,"Bank account currency"]
[null,"Accountholder Name 口座名義 （記入の際は半角カタカナ） \n例:ﾚｺﾞｼﾞｬﾊﾟﾝ(ｶ) スペース、カッコ全て半角使用 ",null,null,null,"Accountholder Name 口座名義 （記入の際は半角カタカナ） \n例:ﾚｺﾞｼﾞｬﾊﾟﾝ(ｶ) スペース、カッコ全て半角使用 "]
[null,"SWIFT code スウィフトコード ",null,null,null,"SWIFT code スウィフトコード "]
[null,"IBAN",null,null,null,"IBAN"]
{"$rows_left_out":16}
{"sheet":"Ukrainian","index":4,"n_rows":37,"n_cols":8,"rows_kept":37,"cut":false,"hidden":false,"merged":[[34,1,34,2],[35,1,35,2],[36,1,36,2],[13,1,13,2],[14,1,14,2],[17,1,17,2],[30,1,30,2],[23,1,23,3],[24,1,24,2],[25,1,25,2],[26,1,26,2],[28,1,28,2],[16,1,16,2],[22,1,22,2],[19,1,19,2],[31,1,31,2],[20,1,20,2],[20,5,20,6],[21,1,21,2],[21,5,21,6],[3,1,3,2],[7,1,7,3],[11,1,11,2],[11,5,11,6],[12,5,12,6],[4,1,4,2],[5,1,5,2],[6,1,6,2],[9,1,9,2],[10,1,10,3],[12,1,12,2],[32,1,32,2],[13,5,13,6],[28,5,28,6],[34,5,34,6],[35,5,35,6],[16,5,16,6],[17,5,17,6],[18,1,18,2],[18,5,18,6],[33,1,33,2],[33,5,33,6],[19,5,19,6],[22,5,22,6],[25,5,25,6],[26,5,26,6],[27,1,27,2],[36,5,36,6],[30,5,30,6],[31,5,31,6],[32,5,32,6],[14,5,14,6],[27,5,27,6]]}
[null,null,"Documentation of company information"]
[]
[null,"Company details"]
[null,"Name of company (назва компанії) - English"]
[null,"Name of company (назва компанії) - Ukrainian"]
[null,"Tax number 1 (ІНН)"]
[null,"Tax number 2 (код ЄДРПОУ) (Mandatory) "]
[]
[null,"Contact details"]
[null,"E-mail address for remittance advice"]
[]
[null,"Bank details",null,"Account 1",null,"Bank details",null,"Account 2 (where applicable)"]
[null,"Bank name (назва банку) - English",null,null,null,"Bank name (назва банку) - English"]
[null,"Bank name (назва банку) - Ukrainian",null,null,null,"Bank name (назва банку) - Ukrainian"]
[null,"Bank country",null,"please select",null,"Bank country",null,"please select"]
[null,"Routing number/bank key (МФО)","bank key",null,null,"Routing number/bank key (МФО)","bank key"]
[null,"Bank account (розрахунковий рахунок)",null,null,null,"Bank account (розрахунковий рахунок)"]
[null,"Bank account currency",null,null,null,"Bank account currency"]
[null,"Account holder name",null,null,null,"Account holder name"]
[null,"IBAN ",null,null,null,"IBAN "]
{"$rows_left_out":18}
{"sheet":"Russian","index":5,"n_rows":31,"n_cols":8,"rows_kept":31,"cut":false,"hidden":false,"merged":[[3,1,3,2],[7,1,7,3],[9,1,9,2],[10,1,10,3],[11,5,11,6],[4,1,4,2],[5,1,5,2],[6,1,6,2],[11,1,11,2],[12,5,12,6],[13,1,13,2],[13,5,13,6],[14,5,14,6],[16,1,16,2],[16,5,16,6],[12,1,12,2],[14,1,14,2],[20,1,20,3],[22,5,22,6],[17,5,17,6],[18,5,18,6],[19,5,19,6],[17,1,17,2],[18,1,18,2],[19,1,19,2],[21,1,21,2],[22,1,22,2],[28,5,28,6],[29,1,29,2],[29,5,29,6],[30,5,30,6],[23,5,23,6],[24,5,24,6],[25,1,25,2],[25,5,25,6],[27,5,27,6],[27,1,27,2],[23,1,23,2],[24,1,24,2],[28,1,28,2],[30,1,30,2]]}
[null,null,"Documentation of company information"]
[]
[null,"Company details"]
[null,"Name of company / Наименование компании - English"]
[null,"Name of company / Наименование компании - Russian"]
[null,"Tax number 1 (ИНН) "]
[null,"Tax number 3 (КПП) "]
[]
[null,"Contact details"]
[null,"E-mail address (remittance advice) / E-mail (финансовый отдел)"]
[]
[null,"Bank details",null,"Account 1",null,"Bank details",null,"Account 2 (where applicable)"]
[null,"Bank name / Наименование банка - English",null,null,null,"Bank name / Наименование банка - English"]
[null,"Bank name / Наименование банка - Russian",null,null,null,"Bank name / Наименование банка - Russian"]
[null,"Bank country",null,"please select",null,"Bank country",null,"please select"]
[null,"Bank key / Routing number / БИК","bank key",null,null,"Bank key / Routing number / БИК","bank key"]
[null,"Bank account /  Банковский счёт",null,null,null,"Bank account /  Банковский счёт"]
[null,"Bank account currency",null,null,null,"Bank account currency"]
[null,"IBAN (If relevant)",null,null,null,"IBAN (If relevant)"]
[null,"SWIFT code (см. на сайте банка в разделе «Реквизиты») ",null,null,null,"SWIFT code (см. на сайте банка в разделе «Реквизиты») "]
{"$rows_left_out":12}
{"sheet":"South African","index":6,"n_rows":29,"n_cols":8,"rows_kept":29,"cut":false,"hidden":false,"merged":[[9,1,9,2],[9,5,9,6],[13,1,13,2],[13,5,13,6],[18,1,18,3],[14,1,14,2],[14,5,14,6],[15,1,15,2],[15,5,15,6],[16,1,16,2],[16,5,16,6],[10,1,10,2],[10,5,10,6],[11,1,11,2],[11,5,11,6],[25,1,25,2],[28,1,28,2],[28,5,28,6],[24,1,24,2],[24,5,24,6],[26,1,26,2],[26,5,26,6],[27,1,27,2],[27,5,27,6],[25,5,25,6],[20,1,20,2],[20,5,20,6],[22,1,22,2],[22,5,22,6],[17,1,17,2],[17,5,17,6],[19,1,19,2],[21,1,21,2],[21,5,21,6],[3,1,3,2],[4,1,4,2],[5,1,5,3],[7,1,7,2],[8,1,8,3]]}
[null,null,"Documentation of company information"]
[]
[null,"Company details"]
[null,"Name of company "]
[null,"Business Registration number"]
[]
[null,"Contact details"]
[null,"E-mail address for remittance advice"]
[]
[null,"Bank details",null,"Account 1",null,"Bank details",null,"Account 2 (where applicable)"]
[null,"Bank name",null,null,null,"Bank name"]
[null,"Bank country",null,"please select",null,"Bank country",null,"please select"]
[null,"Bank and Branch code (bank key)","bank key",null,null,"Bank and Branch code (bank key)","bank key"]
[null,"Bank account",null,null,null,"Bank account"]
[null,"Bank account currency",null,null,null,"Bank account currency"]
[null,"Branch number",null,null,null,"Branch number"]
[null,"IBAN (If relevant)",null,null,null,"IBAN (If relevant)"]
[null,"SWIFT code",null,null,null,"SWIFT code"]
[]
[null,"Bank details"]
{"$rows_left_out":10}
{"sheet":"French","index":7,"n_rows":29,"n_cols":8,"rows_kept":29,"cut":false,"hidden":false,"merged":[[23,5,23,6],[24,5,24,6],[25,5,25,6],[26,5,26,6],[27,5,27,6],[28,1,28,2],[28,5,28,6],[16,5,16,6],[17,5,17,6],[20,5,20,6],[21,5,21,6],[22,1,22,2],[22,5,22,6],[18,1,18,3],[19,1,19,2],[20,1,20,2],[21,1,21,2],[23,1,23,2],[24,1,24,2],[25,1,25,2],[26,1,26,2],[11,5,11,6],[13,1,13,2],[13,5,13,6],[14,5,14,6],[15,1,15,2],[15,5,15,6],[12,5,12,6],[3,1,3,2],[5,1,5,3],[9,1,9,2],[9,5,9,6],[10,5,10,6],[27,1,27,2],[17,1,17,2],[4,1,4,2],[7,1,7,2],[8,1,8,3],[10,1,10,2],[11,1,11,2],[12,1,12,2],[14,1,14,2],[16,1,16,2]]}
[null,null,"Documentation of company information"]
[]
[null,"Company details"]
[null,"Name of company / Nom de l'entreprise"]
[null,"TAX number / Numéro de TVA / Numéro fiscal / Numéro CVR"]
[]
[null,"Contact details"]
[null,"Contact person for remittance advice (e-mail address) / Personne de contact pour les ventes (email)"]
[]
[null,"Bank details",null,"Account 1",null,"Bank details",null,"Account 2 (where applicable)"]
[null,"Bank name / Nom de banque",null,null,null,"Bank name / Nom de banque"]
[null,"Bank country / Pays de la banque",null,"please select",null,"Bank country / Pays de la banque",null,"please select"]
[null,"Bank key / Touche de banque / numéro de routage",null,null,null,"Bank key / Touche de banque / numéro de routage"]
[null,"Bank account / Compte bancaire",null,null,null,"Bank account / Compte bancaire"]
[null,"Bank account currency / Devise du compte bancaire",null,null,null,"Bank account currency / Devise du compte bancaire"]
[null,"Account holder name",null,null,null,"Account holder name"]
[null,"IBAN ",null,null,null,"IBAN "]
[null,"SWIFT code",null,null,null,"SWIFT code"]
[]
[null,"Bank details"]
{"$rows_left_out":10}
{"sheet":"Brazilian","index":8,"n_rows":29,"n_cols":8,"rows_kept":29,"cut":false,"hidden":false,"merged":[[25,5,25,6],[26,5,26,6],[27,5,27,6],[28,1,28,2],[28,5,28,6],[25,1,25,2],[26,1,26,2],[27,1,27,2],[21,5,21,6],[22,1,22,2],[22,5,22,6],[23,5,23,6],[24,5,24,6],[21,1,21,2],[23,1,23,2],[24,1,24,2],[15,5,15,6],[16,1,16,2],[16,5,16,6],[17,5,17,6],[20,5,20,6],[18,1,18,3],[19,1,19,2],[20,1,20,2],[17,1,17,2],[15,1,15,2],[11,5,11,6],[12,5,12,6],[13,1,13,2],[13,5,13,6],[14,5,14,6],[11,1,11,2],[12,1,12,2],[14,1,14,2],[3,1,3,2],[5,1,5,3],[9,1,9,2],[9,5,9,6],[10,5,10,6],[4,1,4,2],[7,1,7,2],[8,1,8,3],[10,1,10,2]]}
[null,null,"Documentation of company information"]
[]
[null,"Company details"]
[null,"Name of company (Nome da empresa)"]
[null,"TAX number / CVR number (CNPJ / Incrição Estadual / Inscrição Municipal)"]
[]
[null,"Contact details"]
[null,"E-mail address (remittance advice) (Email de contato do depto financeiro)"]
[]
[null,"Bank details",null,"Account 1",null,"Bank details",null,"Account 2 (where applicable)"]
[null,"Bank name (Nome do banco)",null,null,null,"Bank name (Nome do banco)"]
[null,"Bank country (País do banco)",null,"please select",null,"Bank country (País do banco)",null,"please select"]
[null,"Bank key / Routing number (Nº do banco)\n(For US ACH account)",null,null,null,"Bank key / Routing number (Nº do banco)\n(For US ACH account)"]
[null,"Bank account / Compte bancaire",null,null,null,"Bank account / Compte bancaire"]
[null,"Bank account currency (Moeda da conta bancária)",null,null,null,"Bank account currency (Moeda da conta bancária)"]
[null,"Bank account (Agência e conta conrrente)",null,null,null,"Bank account (Agência e conta conrrente)"]
[null,"IBAN where applicable (onde aplicável)",null,null,null,"IBAN where applicable (onde aplicável)"]
[null,"SWIFT code",null,null,null,"SWIFT code"]
[]
[null,"Bank details"]
{"$rows_left_out":10}
{"sheet":"USCanadian","index":9,"n_rows":33,"n_cols":8,"rows_kept":33,"cut":false,"hidden":false,"merged":[[32,1,32,2],[32,5,32,6],[12,1,12,2],[12,5,12,6],[17,5,17,6],[18,5,18,6],[25,1,25,2],[25,5,25,6],[28,1,28,2],[28,5,28,6],[29,1,29,2],[29,5,29,6],[30,1,30,2],[30,5,30,6],[26,1,26,2],[26,5,26,6],[27,1,27,2],[27,5,27,6],[31,1,31,2],[31,5,31,6],[22,1,22,2],[22,5,22,6],[24,1,24,2],[24,5,24,6],[16,1,16,2],[16,5,16,6],[19,1,19,2],[19,5,19,6],[20,1,20,3],[21,1,21,2],[18,1,18,2],[17,1,17,2],[23,1,23,2],[23,5,23,6],[13,1,13,2],[13,5,13,6],[14,1,14,2],[14,5,14,6],[15,1,15,2],[15,5,15,6],[9,5,9,6],[10,1,10,2],[10,5,10,6],[11,1,11,2],[11,5,11,6],[9,1,9,2],[3,1,3,2],[4,1,4,2],[5,1,5,3],[7,1,7,2],[8,1,8,3]]}
[null,null,"Documentation of company information"]
[]
[null,"Company details"]
[null,"Name of company "]
[null,"Tax ID Number"]
[]
[null,"Contact details"]
[null,"E-mail address for payment advice and finance contact name"]
[]
[null,"Bank details",null,"Account 1",null,"Bank details",null,"Account 2 (where applicable)"]
[null,"Bank name",null,null,null,"Bank name"]
[null,"Bank country",null,"please select",null,"Bank country",null,"please select"]
[null,"Bank and Branch code (bank key)",null,null,null,"Bank and Branch code (bank key)"]
[null,"Bank account",null,null,null,"Bank account"]
[null,"Bank account currency",null,null,null,"Bank account currency"]
[null,"Account holder name",null,null,null,"Account holder name"]
[null,"IBAN (If relevant)",null,null,null,"IBAN (If relevant)"]
[null,"SWIFT code",null,null,null,"SWIFT code"]
[null,"In Canada, Institution ID",null,null,null,"In Canada, Institution ID"]
[null,"In Canada, Branch ID",null,null,null,"In Canada, Branch ID"]
{"$rows_left_out":14}
{"sheet":"Indian","index":10,"n_rows":84,"n_cols":8,"rows_kept":84,"cut":false,"hidden":false,"merged":[[83,1,83,2],[83,5,83,6],[46,1,46,2],[37,1,37,5],[33,1,33,3],[35,1,35,2],[54,1,54,2],[44,1,44,2],[45,1,45,2],[47,1,47,3],[49,1,49,2],[50,1,50,2],[51,1,51,2],[52,1,52,3],[53,1,53,2],[75,1,75,2],[77,1,77,2],[77,5,77,6],[8,1,8,2],[9,1,9,2],[14,1,14,2],[15,1,15,2],[16,1,16,2],[27,1,27,2],[28,1,28,2],[29,1,29,2],[30,1,30,2],[31,1,31,2],[18,1,18,2],[17,1,17,3],[23,1,23,2],[24,1,24,2],[73,1,73,2],[73,5,73,6],[75,5,75,6],[76,1,76,2],[76,5,76,6],[61,1,61,2],[61,5,61,6],[62,1,62,2],[62,5,62,6],[68,1,68,2],[68,5,68,6],[71,1,71,2],[71,5,71,6],[72,1,72,2],[72,5,72,6],[69,1,69,3],[70,1,70,2],[57,1,57,2],[57,5,57,6],[58,1,58,2],[56,1,56,2],[60,1,60,2],[60,5,60,6],[3,1,3,2],[11,1,11,2],[12,1,12,3],[19,1,19,2],[20,1,20,3],[59,1,59,2],[59,5,59,6],[74,1,74,2],[74,5,74,6],[4,1,4,2],[10,1,10,2],[5,1,5,2],[7,1,7,2],[58,5,58,6],[25,1,25,2],[32,1,32,3],[39,1,39,2],[40,1,40,2],[41,1,41,2],[43,1,43,2],[56,5,56,6]]}
[null,null,"Documentation of company information"]
[]
[null,"Company details"]
[null,"Legal company name"]
[null,"Registered Office address"]
[null,"State (number and name)"]
[null,"Country"]
[null,"Corporate Identify Number (CIN) (India spec.)"]
[null,"Office phone number"]
[null,"Fax number"]
[null,"State (number and name)"]
[null,"VAT number / TAX number / CVR number (CNPJ / Incrição Estadual / Inscrição Municipal)"]
[]
[null,"Contact details"]
[null,"Contact person (name)"]
[null,"Contact person (e-mail address)"]
[null,"E-mail address (remittance advice)"]
[]
[null,"Under MSME Act (Yes/No) (India specific)"]
[null,"MSME certificate number (if Yes)"]
{"$rows_left_out":65}
{"sheet":"South Korean","index":11,"n_rows":93,"n_cols":8,"rows_kept":93,"cut":false,"hidden":false,"merged":[[30,1,30,2],[24,1,24,2],[3,1,3,2],[6,1,6,3],[8,1,8,2],[9,1,9,3],[10,1,10,3],[5,1,5,2],[11,5,11,6],[12,5,12,6],[13,1,13,2],[13,5,13,6],[15,1,15,2],[15,5,15,6],[11,1,11,2],[12,1,12,2],[14,1,14,2],[14,5,14,6],[16,5,16,6],[17,5,17,6],[18,5,18,6],[17,1,17,2],[16,1,16,2],[18,1,18,2],[19,5,19,6],[20,1,20,3],[21,5,21,6],[22,5,22,6],[19,1,19,2],[21,1,21,2],[22,1,22,2],[28,5,28,6],[29,5,29,6],[28,1,28,2],[29,1,29,2],[23,5,23,6],[25,5,25,6],[26,1,26,2],[26,5,26,6],[27,5,27,6],[23,1,23,2],[25,1,25,2],[27,1,27,2],[24,5,24,6]]}
[null,null,"Documentation of company information"]
[]
[null,"Company details"]
[null,"Name of company  법인명 "]
[null,"Name of company (English)  법인 명 (영어)"]
[null,"TAX number 사업자등록번호"]
[]
[null,"Contact details"]
[null,"E-mail address (remittance advice) 이메일주소(송금전표용)"]
[]
[]
[null,"Bank details",null,"Account 1",null,"Bank details",null,"Account 2 (where applicable)"]
[null,"Bank name 은행이름",null,null,null,"Bank name 은행이름"]
[null,"Bank country",null,"please select",null,"Bank country",null,"please select"]
[null,"Bank key (refer to attachement 1) 은행별 코드 (첨부 참조)",null,null,null,"Bank key (refer to attachement 1) 은행별 코드 (첨부 참조)"]
[null,"Bank account 계좌번호 ",null,null,null,"Bank account 계좌번호 "]
[null,"Bank account currency",null,null,null,"Bank account currency"]
[null,"Branch name 지점이름",null,null,null,"Branch name 지점이름"]
[null,"SWIFT code 코드",null,null,null,"SWIFT code 코드"]
[null,"IBAN",null,null,null,"IBAN"]
{"$rows_left_out":74}
{"sheet":"Sheet2","index":12,"n_rows":15,"n_cols":2,"rows_kept":15,"cut":false,"hidden":true,"merged":[]}
[1,"index a match na jazykove verze"]
[2,"skryt vzorce"]
[3,"zamknout strukturu : protect workbook - structure"]
[4,"rozbaleni vice uctu podminenym formatovanim - if valu 2 = formatuj "]
[5,"tisk "]
[]
[]
[]
[]
[]
[]
[]
[]
[]
[7,"jazykove verze chytra tabulka"]

{"sheet":"Sheet3","index":13,"n_rows":263,"n_cols":11,"rows_kept":263,"cut":false,"hidden":true,"merged":[]}
["please select","bank key",null,"please select",null,"please select","please select",null,"Bank code","Bank name(En)","Bank Name(Ko)"]
["AD - Andorra",null,null,"English",null,1,"cheque",null,2,"Korea Development Bank","산업은행"]
["AE - Utd.Arab Emir.",null,null,"French",null,2,"bank transfer",null,3,"Industrial Bank Of Korea","기업은행"]
["AF - Afghanistan",null,null,"Japanese / 日本語",null,3,null,null,4,"Kookmin Bank","국민은행"]
["AG - Antigua/Barbuda",null,null,"Chinesse / 中国",null,4,null,null,81,"KEB(Korea Exchange Bank) Hana bank","KEB하나은행"]
["AI - Anguilla",null,null,"Spanish",null,null,null,null,7,"Suhyup Bank","수협중앙회"]
["AL - Albania",null,null,"Russian",null,null,null,null,8,"The Export-Import Bank of Korea","수출입은행"]
["AM - Armenia",null,null,"Ukrainian",null,null,null,null,11,"Nonghyup Bank(National Agricultural Cooperative Federation)","농협중앙회"]
["AN - Dutch Antilles",null,null,"Deutch",null,null,null,null,12,"National Agricultural Union","농협회원조합"]
["AO - Angola",null,null,null,null,null,null,null,20,"Woori Bank","우리은행"]
["AQ - Antarctica",null,null,null,null,null,null,null,23,"Standard Chartered","SC은행"]
["AR - Argentina",null,null,null,null,null,null,null,27,"Citibank Korea","한국시티은행"]
["AS - Samoa, American",null,null,null,null,null,null,null,31,"Daegu Bank","대구은행"]
["AT - Austria",null,null,null,null,null,null,null,32,"Busan Bank","부산은행"]
["AU - Australia",null,null,null,null,null,null,null,34,"Kwangju Bank","광주은행"]
["AW - Aruba",null,null,null,null,null,null,null,35,"Jeju Bank","제주은행"]
["AX - Aland Islands",null,null,null,null,null,null,null,37,"Jeonbuk Bank","전북은행"]
["AZ - Azerbaijan",null,null,null,null,null,null,null,39,"Kyongnam Bank","경남은행"]
["BA - Bosnia-Herz.",null,null,null,null,null,null,null,45,"Korean Federation Of Community","새마을금고연합회"]
["BB - Barbados",null,null,null,null,null,null,null,48,"Credit Union Bank","신용협동조합중앙회"]
{"$rows_left_out":244}
{"sheet":"jazykove verze","index":14,"n_rows":8,"n_cols":11,"rows_kept":8,"cut":false,"hidden":true,"merged":[]}
["English","Chinesse / 中国","French","Japanese / 日本語","Spanish","Ukrainian","Deutche","Russia","Korea","India","Brazilia"]
["Name of company ","Name of company – English  公司名称 (英文)","Name of company / Nom de l'entreprise"]
[null,"Name of company – Chinese 公司名称 (华文)",null,null,null,"Name of company - local characters",null,"Name of company - local characters"]
["VAT number  or  TAX number \n(CVR number, steuer number etc.)","TAX number 税号 ","TAX number / Numéro de TVA / Numéro fiscal / Numéro CVR"]
["Business address / street","Business address 公司地址","Business address / Adresse d'affaires",null,null,"Address in local characters",null,"Address in local characters"]
["Postal Code / City","Postal Code / City 邮编 / 城市","Postal Code / City / Code postal / Ville"]
[null,null,null,"control key",null,"Liable for VAT"]
[null,null,null,null,null,"Natural person"]

{"sheet":"English (2)","index":15,"n_rows":38,"n_cols":6,"rows_kept":38,"cut":false,"hidden":true,"merged":[[38,1,38,3],[31,1,31,2],[33,1,33,2],[34,1,34,2],[35,1,35,2],[36,1,36,2],[37,1,37,2],[30,1,30,2],[18,1,18,3],[19,1,19,2],[20,1,20,2],[21,1,21,2],[23,1,23,2],[24,1,24,2],[25,1,25,2],[26,1,26,2],[27,1,27,2],[28,1,28,3],[29,1,29,2],[17,1,17,2],[4,1,4,2],[5,1,5,2],[6,1,6,2],[7,1,7,2],[8,1,8,3],[10,1,10,2],[11,1,11,2],[12,1,12,2],[13,1,13,3],[14,1,14,2],[16,1,16,3]]}
[null,null,"Documentation of company information"]
["*","Please select the language version",null,"English"]
[]
[null,"Company details"]
[null,{"$f":"IFERROR(INDEX('jazykove verze'!$A$1:$C$6,2,MATCH($D$2,'jazykove verze'!$A$1:$C$1,0)),\"\")","v":"Name of company "}]
[null,{"$f":"IFERROR(INDEX('jazykove verze'!$A$1:$C$6,3,MATCH($D$2,'jazykove verze'!$A$1:$C$1,0)),\"\")","v":0}]
[null,{"$f":"IFERROR(INDEX('jazykove verze'!$A$1:$C$6,4,MATCH($D$2,'jazykove verze'!$A$1:$C$1,0)),\"\")","v":"VAT number  or  TAX number \n(CVR number, steuer number etc.)"}]
[null,{"$f":"IFERROR(INDEX('jazykove verze'!$A$1:$C$6,5,MATCH($D$2,'jazykove verze'!$A$1:$C$1,0)),\"\")","v":"Business address / street"}]
[]
[null,"Contact details"]
[null,"Contact person for sending POs (name)"]
[null,"Email address of contact person for sending POs "]
[null,"E-mail address  for remittance advice"]
[]
["*","Type of payment",null,"bank transfer"]
[null,"Number of bank accounts",null,4]
[]
[null,"Payment terms - standard 60 days",null,"60 days"]
[]
[null,"Bank details"]
{"$rows_left_out":18}